CholmodSolver: EXPERIMENTAL long mode support

6 jobs for cgg in 8 minutes and 18 seconds (queued for 1 second)
Status Job ID Name Coverage
  Test
failed #83407
Qt551 VS2013
CoMISo-VS2013-Qt-5.5.1-x64

00:01:08

failed #83408
IPOPT3129 VS2017
CoMISo-VS2017-Qt-5.10.1-x64

00:01:10

passed #83405
Linux
clang-c++11

00:08:17

passed #83404
Linux
gcc-c++11

00:06:02

failed #83406
Apple
macos-c++11

00:00:12

 
  Deploy
skipped #83409
trigger_build
 
Name Stage Failure
failed
CoMISo-VS2017-Qt-5.10.1-x64 Test
16>        ]
16>Done building project "small_quadratic_solver.vcxproj" -- FAILED.
5>LINK : fatal error LNK1181: cannot open input file '..\..\Release\CoMISo.lib'
5>Done building project "small_AQP.vcxproj" -- FAILED.
18>------ Build started: Project: ALL_BUILD, Configuration: Release x64 ------
18>Building Custom Rule E:/gitlab/builds/9d73ae51/0/CoMISo/CoMISo/CMakeLists.txt
18>CMake does not need to re-run because E:/gitlab/builds/9d73ae51/0/CoMISo/CoMISo/rel/CMakeFiles/generate.stamp is up-to-date.
========== Build: 2 succeeded, 16 failed, 0 up-to-date, 0 skipped ==========
ERROR: Job failed: exit status 1
failed
CoMISo-VS2013-Qt-5.5.1-x64 Test
16>          ]
7>LINK : fatal error LNK1181: cannot open input file '..\..\Release\CoMISo.lib'
14>LINK : fatal error LNK1181: cannot open input file '..\..\Release\CoMISo.lib'
5>LINK : fatal error LNK1181: cannot open input file '..\..\Release\CoMISo.lib'
18>------ Build started: Project: ALL_BUILD, Configuration: Release x64 ------
18> Building Custom Rule E:/gitlab/builds/1900f1de/0/CoMISo/CoMISo/CMakeLists.txt
18> CMake does not need to re-run because E:/gitlab/builds/1900f1de/0/CoMISo/CoMISo/rel/CMakeFiles/generate.stamp is up-to-date.
========== Build: 2 succeeded, 16 failed, 0 up-to-date, 0 skipped ==========
ERROR: Job failed: exit status 1
failed
macos-c++11 Test
In file included from /Users/jenkins/builds/8dfb9a4a/0/CoMISo/CoMISo/Solver/ConstrainedSolver.cc:26:
/Users/jenkins/builds/8dfb9a4a/0/CoMISo/CoMISo/Solver/ConstrainedSolverT.cc:821:44: error: no member named 'swap' in 'gmm::simple_vector_ref<gmm::wsvector<double> *>'
gmm::mat_row(d_tmp, row_ordering[i]).swap(gmm::mat_row(rhs_update_table_.D_, i));
~~~~~~~~~~~~~~~~~~~~~~~~~~~~~~~~~~~~ ^
1 error generated.
make[2]: *** [CMakeFiles/CoMISo.dir/Solver/ConstrainedSolver.cc.o] Error 1
make[1]: *** [CMakeFiles/CoMISo.dir/all] Error 2
make: *** [all] Error 2
ERROR: Job failed: exit status 1