Added iwyu to cmake calls

30 jobs for 178-include-what-you-use-job-for-openflipper in 46 minutes and 48 seconds (queued for 3 seconds)
Status Job ID Name Coverage
  Build
canceled #116650
qt5113 Apple
Mac-Cpp11

00:21:14

passed #116648
Python39 Qt5141 VS2017
VS2017-Qt5.14.1-x64

00:17:12

passed #116649
Qt5141 VS2017
VS2017-Qt5.14.1-x64-NOPYTHON

00:15:14

passed #116646
Python39 Qt5150 VS2019
VS2019-Qt5.15.0-x64

00:11:32

passed #116647
Qt5150 VS2019
VS2019-Qt5.15.0-x64-NOPYTHON

00:11:16

failed #116641
stretch Linux
build-debug-clang-cpp11-qt5.15.1

00:06:28

failed #116642
stretch Linux
build-debug-clang-cpp11-qt5.15.1-nopython

00:06:25

failed #116637
stretch Linux
build-debug-gcc-cpp11-qt5.15.1

00:05:28

failed #116638
stretch Linux
build-debug-gcc-cpp11-qt5.15.1-nopython

00:05:15

failed #116643
stretch Linux
build-release-clang-cpp11-qt5.15.1

00:08:20

failed #116644
stretch Linux
build-release-clang-cpp11-qt5.15.1-nopython

00:07:41

failed #116631
stretch Linux
build-release-gcc-cpp11-qt5.11.2

00:02:28

failed #116632
stretch Linux
build-release-gcc-cpp11-qt5.11.2-nopython

00:05:10

failed #116633
stretch Linux
build-release-gcc-cpp11-qt5.12.2

00:04:43

failed #116634
stretch Linux
build-release-gcc-cpp11-qt5.12.2-nopython

00:02:50

failed #116635
stretch Linux
build-release-gcc-cpp11-qt5.13.0

00:02:36

failed #116636
stretch Linux
build-release-gcc-cpp11-qt5.13.0-nopython

00:02:32

failed #116639
stretch Linux
build-release-gcc-cpp11-qt5.15.1

00:02:38

failed #116640
stretch Linux
build-release-gcc-cpp11-qt5.15.1-nopython

00:02:34

passed #116645
MultiThreads stretch Linux
cppcheck

00:01:13

 
  Test
canceled #116660
qt5113 Apple
Test:Mac-Cpp11

passed #116659
Python39 Qt5141 VS2017
Test:VS2017-Qt5.14.1-x64

00:01:50

canceled #116658
Python39 Qt5150 VS2019
Test:VS2019-Qt5.15.0-x64

00:02:12

skipped #116656
MultiThreads stretch Linux
test-debug-clang-cpp11-qt5.15.1
skipped #116654
MultiThreads stretch Linux
test-debug-gcc-cpp11-qt5.15.1
skipped #116657
MultiThreads stretch Linux
test-release-clang-cpp11-qt5.15.1
skipped #116651
MultiThreads stretch Linux
test-release-gcc-cpp11-qt5.11.2
skipped #116652
MultiThreads stretch Linux
test-release-gcc-cpp11-qt5.12.2
skipped #116653
MultiThreads stretch Linux
test-release-gcc-cpp11-qt5.13.0
skipped #116655
MultiThreads stretch Linux
test-release-gcc-cpp11-qt5.15.1
 
Name Stage Failure
failed
build-release-clang-cpp11-qt5.15.1 Build
#include "qwt_series_data.h"  // for QwtIntervalSeriesData
#include "qwt_text.h" // for QwtText
---

[ 47%] Linking CXX shared library ../../../Build/lib/libACG.so
[ 47%] Built target ACG
make: *** [Makefile:152: all] Error 2
Cleaning up file based variables
ERROR: Job failed: exit status 1
failed
build-release-clang-cpp11-qt5.15.1-nopython Build
#include "qwt_series_data.h"  // for QwtIntervalSeriesData
#include "qwt_text.h" // for QwtText
---

[ 47%] Linking CXX shared library ../../../Build/lib/libACG.so
[ 47%] Built target ACG
make: *** [Makefile:152: all] Error 2
Cleaning up file based variables
ERROR: Job failed: exit status 1
failed
build-debug-clang-cpp11-qt5.15.1-nopython Build
#include "qwt_series_data.h"  // for QwtIntervalSeriesData
#include "qwt_text.h" // for QwtText
---

[ 47%] Linking CXX shared library ../../../Build/lib/libACG.so
[ 47%] Built target ACG
make: *** [Makefile:152: all] Error 2
Cleaning up file based variables
ERROR: Job failed: exit status 1
failed
build-debug-clang-cpp11-qt5.15.1 Build
#include "qwt_series_data.h"  // for QwtIntervalSeriesData
#include "qwt_text.h" // for QwtText
---

[ 47%] Linking CXX shared library ../../../Build/lib/libACG.so
[ 47%] Built target ACG
make: *** [Makefile:152: all] Error 2
Cleaning up file based variables
ERROR: Job failed: exit status 1
failed
build-debug-gcc-cpp11-qt5.15.1-nopython Build
#include "qwt_series_data.h"  // for QwtIntervalSeriesData
#include "qwt_text.h" // for QwtText
---

[ 47%] Linking CXX shared library ../../../Build/lib/libACG.so
[ 47%] Built target ACG
make: *** [Makefile:152: all] Error 2
Cleaning up file based variables
ERROR: Job failed: exit status 1
failed
build-debug-gcc-cpp11-qt5.15.1 Build
#include "qwt_series_data.h"  // for QwtIntervalSeriesData
#include "qwt_text.h" // for QwtText
---

[ 48%] Linking CXX shared library ../../../Build/lib/libACG.so
[ 48%] Built target ACG
make: *** [Makefile:152: all] Error 2
Cleaning up file based variables
ERROR: Job failed: exit status 1
failed
build-release-gcc-cpp11-qt5.15.1-nopython Build
#include "qwt_series_data.h"  // for QwtIntervalSeriesData
#include "qwt_text.h" // for QwtText
---

[ 48%] Linking CXX shared library ../../../Build/lib/libACG.so
[ 48%] Built target ACG
make: *** [Makefile:152: all] Error 2
Cleaning up file based variables
ERROR: Job failed: exit status 1
failed
build-release-gcc-cpp11-qt5.15.1 Build
#include "qwt_series_data.h"  // for QwtIntervalSeriesData
#include "qwt_text.h" // for QwtText
---

[ 48%] Linking CXX shared library ../../../Build/lib/libACG.so
[ 48%] Built target ACG
make: *** [Makefile:152: all] Error 2
Cleaning up file based variables
ERROR: Job failed: exit status 1
failed
build-release-gcc-cpp11-qt5.13.0-nopython Build
#include "qwt_series_data.h"  // for QwtIntervalSeriesData
#include "qwt_text.h" // for QwtText
---

[ 47%] Linking CXX shared library ../../../Build/lib/libACG.so
[ 47%] Built target ACG
make: *** [Makefile:152: all] Error 2
Cleaning up file based variables
ERROR: Job failed: exit status 1
failed
build-release-gcc-cpp11-qt5.13.0 Build
#include "qwt_series_data.h"  // for QwtIntervalSeriesData
#include "qwt_text.h" // for QwtText
---

[ 47%] Linking CXX shared library ../../../Build/lib/libACG.so
[ 47%] Built target ACG
make: *** [Makefile:152: all] Error 2
Cleaning up file based variables
ERROR: Job failed: exit status 1
failed
build-release-gcc-cpp11-qt5.11.2-nopython Build
#include "OpenFlipper/publicWidgets/objectSelectionWidget/TreeItemObjectSelection.hh"
class QObject;
---

[ 51%] Linking CXX shared library ../../Build/lib/libOpenFlipperPluginLib.so
[ 51%] Built target OpenFlipperPluginLib
make: *** [Makefile:152: all] Error 2
Cleaning up file based variables
ERROR: Job failed: exit status 1
failed
build-release-gcc-cpp11-qt5.12.2 Build
#include "qwt_series_data.h"  // for QwtIntervalSeriesData
#include "qwt_text.h" // for QwtText
---

[ 48%] Linking CXX shared library ../../../Build/lib/libACG.so
[ 48%] Built target ACG
make: *** [Makefile:152: all] Error 2
Cleaning up file based variables
ERROR: Job failed: exit status 1
failed
build-release-gcc-cpp11-qt5.12.2-nopython Build
#include "qwt_series_data.h"  // for QwtIntervalSeriesData
#include "qwt_text.h" // for QwtText
---

[ 48%] Linking CXX shared library ../../../Build/lib/libACG.so
[ 48%] Built target ACG
make: *** [Makefile:152: all] Error 2
Cleaning up file based variables
ERROR: Job failed: exit status 1
failed
build-release-gcc-cpp11-qt5.11.2 Build
#include "qwt_series_data.h"  // for QwtIntervalSeriesData
#include "qwt_text.h" // for QwtText
---

[ 47%] Linking CXX shared library ../../../Build/lib/libACG.so
[ 47%] Built target ACG
make: *** [Makefile:152: all] Error 2
Cleaning up file based variables
ERROR: Job failed: exit status 1