Moved ACG into subdir

7 jobs for MoveACG in 23 minutes and 12 seconds
Status Job ID Name Coverage
  Test
failed #19149
Apple
Mac-Cpp11

00:21:46

canceled #19148
Qt551 VS2013
VS2013-Qt-5.5.1-x64

00:11:45

failed #19147
Qt56 VS2015
VS2015-Qt-5.6.0-x32

00:11:26

failed #19146
Qt56 VS2015
VS2015-Qt-5.6.0-x64

00:14:03

failed #19144
MultiThreads Linux
clang-c++11-Qt5

00:07:43

passed #19145
MultiThreads Linux
cppcheck

00:02:10

failed #19143
Linux
gcc-c++11-Qt5

00:03:13

 
Name Stage Failure
failed
Mac-Cpp11 Test There is an unknown failure, please try again
         ^
1 error generated.
make[3]: *** [Plugin-Datacontrol/CMakeFiles/Plugin-Datacontrol.dir/DataControlPlugin.cc.o] Error 1
make[2]: *** [Plugin-Datacontrol/CMakeFiles/Plugin-Datacontrol.dir/all] Error 2
make[1]: *** [CMakeFiles/OpenFlipper_package.dir/rule] Error 2
make: *** [OpenFlipper_package] Error 2
mv: rename *.dmg to OpenFlipper-Free-GIT-4b1bf5266a5f4e5fdab52f5f1c29ebabbf5c1653-QT5.5.1-CPP11.dmg: No such file or directory

ERROR: Build failed: exit status 1
failed
VS2015-Qt-5.6.0-x32 Test There is an unknown failure, please try again
174>    fixbundle.win.cmake:34 (fixup_bundle)
174>
174>
174>
175>------ Erstellen gestartet: Projekt: ALL_BUILD, Konfiguration: Release Win32 ------
175> Building Custom Rule E:/gitlab/builds/281b716d/0/OpenFlipper-Free/OpenFlipper-Free/CMakeLists.txt
175> CMake does not need to re-run because E:\gitlab\builds\281b716d\0\OpenFlipper-Free\OpenFlipper-Free\rel\CMakeFiles\generate.stamp is up-to-date.
========== Erstellen: 75 erfolgreich, 100 fehlerhaft, 0 aktuell, 0 �bersprungen ==========
ERROR: Build failed: exit status 1
failed
VS2015-Qt-5.6.0-x64 Test There is an unknown failure, please try again
174>  Call Stack (most recent call first):
174> fixbundle.win.cmake:34 (fixup_bundle)
174>
174>
175>------ Build started: Project: ALL_BUILD, Configuration: Release x64 ------
175> Building Custom Rule E:/gitlab/builds/7949bd93/0/OpenFlipper-Free/OpenFlipper-Free/CMakeLists.txt
175> CMake does not need to re-run because E:\gitlab\builds\7949bd93\0\OpenFlipper-Free\OpenFlipper-Free\rel\CMakeFiles\generate.stamp is up-to-date.
========== Build: 75 succeeded, 100 failed, 0 up-to-date, 0 skipped ==========
ERROR: Build failed: exit status 1
failed
clang-c++11-Qt5 Test There is an unknown failure, please try again
[ 88%] Building CXX object OpenFlipper/PluginLib/CMakeFiles/OpenFlipperPluginLib.dir/moc_objectPickDialog.cpp.o
[ 88%] Building CXX object OpenFlipper/PluginLib/CMakeFiles/OpenFlipperPluginLib.dir/moc_FilePicker.cpp.o
[ 88%] Building CXX object OpenFlipper/PluginLib/CMakeFiles/OpenFlipperPluginLib.dir/moc_LightWidget.cpp.o
[ 88%] Building CXX object OpenFlipper/PluginLib/CMakeFiles/OpenFlipperPluginLib.dir/moc_QtPlaneSelect.cpp.o
[ 89%] Linking CXX shared library ../../Build/lib/libOpenFlipperPluginLib.so
[ 89%] Built target OpenFlipperPluginLib
Makefile:149: recipe for target 'all' failed
make: *** [all] Error 2
ERROR: Build failed: exit status 1
failed
gcc-c++11-Qt5 Test There is an unknown failure, please try again
[ 89%] Building CXX object OpenFlipper/PluginLib/CMakeFiles/OpenFlipperPluginLib.dir/moc_QtPlaneSelect.cpp.o
[ 89%] Building CXX object OpenFlipper/PluginLib/CMakeFiles/OpenFlipperPluginLib.dir/moc_LightWidget.cpp.o
[ 90%] Linking CXX shared library ../../Build/lib/libOpenFlipperPluginLib.so
[ 90%] Built target OpenFlipperPluginLib
[ 90%] Linking CXX shared library ../../../../Build/python/openmesh.so
[ 90%] Built target openmesh
Makefile:149: recipe for target 'all' failed
make: *** [all] Error 2
ERROR: Build failed: exit status 1