Pull Plugin-INI and OpenFLipper from master as they have been merged (Core...

Pull Plugin-INI and OpenFLipper from master as they have been merged (Core Materialnode  and INI Plugin now support additional material constants)
21 jobs for featurePBMaterial in 22 minutes and 14 seconds (queued for 1 second)
Status Job ID Name Coverage
  Build
failed #37296
Apple
Mac-Cpp11

00:04:19

canceled #37295
Qt551 VS2013
VS2013-Qt-5.5.1-x64

failed #37292
Qt56 VS2015
VS2015-Qt-5.6.2-x32

00:13:07

failed #37291
Qt56 VS2015
VS2015-Qt-5.6.2-x64

00:13:38

canceled #37294
VS2015
VS2015-Qt-5.9.0-x32

00:08:34

canceled #37293
VS2015
VS2015-Qt-5.9.0-x64

00:09:04

failed #37289
MultiThreads Linux
clang-c++11-Qt5

00:04:33

failed #37290
MultiThreads Linux
clang-c++11-Qt5.9.0

00:04:32

failed #37287
Linux
gcc-c++11-Qt5

00:03:02

failed #37288
Linux
gcc-c++11-Qt5.9.0

00:03:08

 
  Test
canceled #37307
Apple
Test:Mac-Cpp11

canceled #37306
Qt551 VS2013
Test:VS2013-Qt-5.5.1-x64

canceled #37303
Qt56 VS2015
Test:VS2015-Qt-5.6.2-x32

canceled #37302
Qt56 VS2015
Test:VS2015-Qt-5.6.2-x64

canceled #37305
VS2015
Test:VS2015-Qt-5.9.0-x32

canceled #37304
VS2015
Test:VS2015-Qt-5.9.0-x64

canceled #37301
MultiThreads Linux
cppcheck

canceled #37299
MultiThreads Linux
test-clang-c++11-Qt5

canceled #37300
MultiThreads Linux
test-clang-c++11-Qt5.9.0

canceled #37297
Linux
test-gcc-c++11-Qt5

canceled #37298
Linux
test-gcc-c++11-Qt5.9.0

 
Name Stage Failure
failed
VS2015-Qt-5.6.2-x64 Build There is an unknown failure, please try again
194>  Call Stack (most recent call first):
194> fixbundle.win.cmake:34 (fixup_bundle)
194>
194>
195>------ Build started: Project: ALL_BUILD, Configuration: Release x64 ------
195> Building Custom Rule E:/gitlab/builds/7949bd93/0/OpenFlipper-Free/OpenFlipper-Free/CMakeLists.txt
195> CMake does not need to re-run because E:\gitlab\builds\7949bd93\0\OpenFlipper-Free\OpenFlipper-Free\rel\CMakeFiles\generate.stamp is up-to-date.
========== Build: 76 succeeded, 119 failed, 0 up-to-date, 0 skipped ==========
ERROR: Job failed: exit status 1
failed
VS2015-Qt-5.6.2-x32 Build There is an unknown failure, please try again
194>    fixbundle.win.cmake:34 (fixup_bundle)
194>
194>
194>
195>------ Erstellen gestartet: Projekt: ALL_BUILD, Konfiguration: Release Win32 ------
195> Building Custom Rule E:/gitlab/builds/2dad8761/0/OpenFlipper-Free/OpenFlipper-Free/CMakeLists.txt
195> CMake does not need to re-run because E:\gitlab\builds\2dad8761\0\OpenFlipper-Free\OpenFlipper-Free\rel\CMakeFiles\generate.stamp is up-to-date.
========== Erstellen: 76 erfolgreich, 119 fehlerhaft, 0 aktuell, 0 �bersprungen ==========
ERROR: Job failed: exit status 1
failed
clang-c++11-Qt5 Build There is an unknown failure, please try again
make[2]: *** Waiting for unfinished jobs....
CMakeFiles/Makefile2:2327: recipe for target 'OpenFlipper/libs_required/ACG/CMakeFiles/ACG.dir/all' failed
make[1]: *** [OpenFlipper/libs_required/ACG/CMakeFiles/ACG.dir/all] Error 2
make[1]: *** Waiting for unfinished jobs....
[ 49%] Linking CXX executable ../../../../../Unittests/unittests
[ 49%] Built target unittests
Makefile:149: recipe for target 'all' failed
make: *** [all] Error 2
ERROR: Job failed: exit status 1
failed
clang-c++11-Qt5.9.0 Build There is an unknown failure, please try again
[ 48%] Building CXX object OpenFlipper/libs_required/OpenMesh/src/Unittests/CMakeFiles/unittests.dir/unittests_trimesh_vec2i.cc.o
[ 48%] Building CXX object OpenFlipper/libs_required/OpenMesh/src/Unittests/CMakeFiles/unittests.dir/unittests_tutorials.cc.o
[ 48%] Building CXX object OpenFlipper/libs_required/OpenMesh/src/Unittests/CMakeFiles/unittests.dir/unittests_vdpm.cc.o
[ 48%] Building CXX object OpenFlipper/libs_required/OpenMesh/src/Unittests/CMakeFiles/unittests.dir/unittests_vector_type.cc.o
[ 49%] Linking CXX executable ../../../../../Unittests/unittests
[ 49%] Built target unittests
Makefile:149: recipe for target 'all' failed
make: *** [all] Error 2
ERROR: Job failed: exit status 1
failed
Mac-Cpp11 Build There is an unknown failure, please try again
/Users/jenkins/builds/8dfb9a4a/0/OpenFlipper-Free/OpenFlipper-Free/OpenFlipper/libs_required/ACG/Scenegraph/MaterialNode.hh:225:10: note: 'setRefractive' declared here
void setRefractive(bool _r) { isRefractive_ = _r; }
^
1 error generated.
make[3]: *** [OpenFlipper/libs_required/ACG/CMakeFiles/ACG.dir/Scenegraph/MaterialNode.cc.o] Error 1
make[2]: *** [OpenFlipper/libs_required/ACG/CMakeFiles/ACG.dir/all] Error 2
make[1]: *** [CMakeFiles/fixbundle.dir/rule] Error 2
make: *** [fixbundle] Error 2
ERROR: Job failed: exit status 1
failed
gcc-c++11-Qt5.9.0 Build There is an unknown failure, please try again
make[1]: *** [OpenFlipper/libs_required/ACG/CMakeFiles/ACG.dir/all] Error 2
make[1]: *** Waiting for unfinished jobs....
[ 49%] Linking CXX executable ../../../../../Unittests/unittests
[ 49%] Built target unittests
[ 50%] Linking CXX shared library ../../../../../Build/python/openmesh.so
[ 50%] Built target openmesh
Makefile:149: recipe for target 'all' failed
make: *** [all] Error 2
ERROR: Job failed: exit status 1
failed
gcc-c++11-Qt5 Build There is an unknown failure, please try again
make[1]: *** [OpenFlipper/libs_required/ACG/CMakeFiles/ACG.dir/all] Error 2
make[1]: *** Waiting for unfinished jobs....
[ 49%] Linking CXX executable ../../../../../Unittests/unittests
[ 49%] Built target unittests
[ 50%] Linking CXX shared library ../../../../../Build/python/openmesh.so
[ 50%] Built target openmesh
Makefile:149: recipe for target 'all' failed
make: *** [all] Error 2
ERROR: Job failed: exit status 1