Removed glut dependency

closes #155
25 jobs for master in 7 minutes and 29 seconds (queued for 1 second)
Status Job ID Name Coverage
  Build
canceled #68248
qt5113 Apple
Mac-Cpp11

canceled #68246
Qt5101 VS2015
VS2015-Qt-5.10.1-x64

canceled #68247
Qt5101 VS2017
VS2017-Qt-5.10.1

failed #68242
MultiThreads stretch Linux
clang-c++11-Qt5.11.2

00:05:05

canceled #68243
MultiThreads stretch Linux
clang-c++11-Qt5.9.0

00:03:13

canceled #68245
MultiThreads stretch Linux
cppcheck

00:03:00

canceled #68244
MultiThreads stretch Linux
debug-clang-c++11-Qt5.9.0

00:03:05

failed #68241
stretch Linux
debug-gcc-c++11-Qt5.11.2

00:02:35

failed #68240
stretch Linux
debug-gcc-c++11-Qt5.9.0

00:04:29

failed #68238
stretch Linux
gcc-c++11-Qt5.11.2

00:04:15

failed #68239
stretch Linux
gcc-c++11-Qt5.9.0

00:02:06

 
  Test
canceled #68258
qt5113 Apple
Test:Mac-Cpp11

canceled #68256
Qt5101 VS2015
Test:VS2015-Qt-5.10.1-x64

canceled #68257
Qt5101 VS2017
Test:VS2017-Qt-5.10.1

canceled #68255
MultiThreads stretch Linux
debug-test-clang-c++11-Qt5.9.0

canceled #68252
stretch Linux
debug-test-gcc-c++11-Qt5.11.2

canceled #68251
stretch Linux
debug-test-gcc-c++11-Qt5.9.0

canceled #68253
MultiThreads stretch Linux
test-clang-c++11-Qt5.11.2

canceled #68254
MultiThreads stretch Linux
test-clang-c++11-Qt5.9.0

canceled #68249
stretch Linux
test-gcc-c++11-Qt5.11.2

canceled #68250
stretch Linux
test-gcc-c++11-Qt5.9.0

 
  Deploy
canceled #68261
qt5113 Apple
Deploy:Mac-Cpp11

canceled #68259
Qt5101 VS2015
Deploy:VS2015-Qt-5.10.1-x64

canceled #68260
Qt5101 VS2017
Deploy:VS2017-Qt-5.10.1

canceled #68262
stretch Linux
Doc-publish

 
Name Stage Failure
failed
clang-c++11-Qt5.11.2 Build
8 warnings generated.
[ 50%] Building CXX object OpenFlipper/libs_required/OpenMesh/src/Unittests/CMakeFiles/unittests_customvec.dir/unittests_customvec_autogen/mocs_compilation.cpp.o
[ 50%] Linking CXX executable ../../../../../Unittests/unittests
[ 50%] Built target unittests
[ 50%] Linking CXX executable ../../../../../Unittests/unittests_customvec
[ 50%] Built target unittests_customvec
Makefile:151: recipe for target 'all' failed
make: *** [all] Error 2
ERROR: Job failed: exit status 1
failed
debug-gcc-c++11-Qt5.9.0 Build
CMakeFiles/Makefile2:2427: recipe for target 'OpenFlipper/libs_required/ACG/CMakeFiles/ACG.dir/all' failed
make[1]: *** [OpenFlipper/libs_required/ACG/CMakeFiles/ACG.dir/all] Error 2
make[1]: *** Waiting for unfinished jobs....
[ 50%] Linking CXX executable ../../../../../Unittests/unittests_customvec
[ 50%] Built target unittests
[ 50%] Built target unittests_customvec
Makefile:151: recipe for target 'all' failed
make: *** [all] Error 2
ERROR: Job failed: exit status 1
failed
debug-gcc-c++11-Qt5.11.2 Build
make[1]: *** [OpenFlipper/libs_required/ACG/CMakeFiles/ACG.dir/all] Error 2
make[1]: *** Waiting for unfinished jobs....
[ 51%] Linking CXX executable ../../../../../Unittests/unittests
[ 51%] Linking CXX executable ../../../../../Unittests/unittests_customvec
[ 51%] Built target unittests
[ 51%] Built target unittests_customvec
Makefile:151: recipe for target 'all' failed
make: *** [all] Error 2
ERROR: Job failed: exit status 1
failed
gcc-c++11-Qt5.11.2 Build
make[1]: *** [OpenFlipper/libs_required/ACG/CMakeFiles/ACG.dir/all] Error 2
make[1]: *** Waiting for unfinished jobs....
[ 51%] Linking CXX executable ../../../../../Unittests/unittests
[ 51%] Linking CXX executable ../../../../../Unittests/unittests_customvec
[ 51%] Built target unittests_customvec
[ 51%] Built target unittests
Makefile:151: recipe for target 'all' failed
make: *** [all] Error 2
ERROR: Job failed: exit status 1
failed
gcc-c++11-Qt5.9.0 Build
make[1]: *** [OpenFlipper/libs_required/ACG/CMakeFiles/ACG.dir/all] Error 2
make[1]: *** Waiting for unfinished jobs....
[ 51%] Linking CXX executable ../../../../../Unittests/unittests
[ 51%] Built target unittests
[ 51%] Linking CXX executable ../../../../../Unittests/unittests_customvec
[ 51%] Built target unittests_customvec
Makefile:151: recipe for target 'all' failed
make: *** [all] Error 2
ERROR: Job failed: exit status 1