Added VolumeMesh Convert plugin

25 jobs for VolMeshConverter in 17 minutes and 35 seconds (queued for 1 second)
Status Job ID Name Coverage
  Build
passed #74851
qt5113 Apple
Mac-Cpp11

00:17:34

failed #74849
Qt5101 VS2015
VS2015-Qt-5.10.1-x64

00:14:03

failed #74850
Qt5101 VS2017
VS2017-Qt-5.10.1

00:15:23

failed #74845
MultiThreads stretch Linux
clang-c++11-Qt5.11.2

00:15:21

failed #74846
MultiThreads stretch Linux
clang-c++11-Qt5.9.0

00:14:59

passed #74848
MultiThreads stretch Linux
cppcheck

00:01:51

failed #74847
MultiThreads stretch Linux
debug-clang-c++11-Qt5.9.0

00:09:41

failed #74844
stretch Linux
debug-gcc-c++11-Qt5.11.2

00:04:33

failed #74843
stretch Linux
debug-gcc-c++11-Qt5.9.0

00:08:10

failed #74840
stretch Linux
gcc-c++11-Qt5.11.2

00:05:52

failed #74841
stretch Linux
gcc-c++11-Qt5.11.2-nopython

00:08:03

failed #74838
stretch Linux
gcc-c++11-Qt5.12.2

00:05:01

failed #74839
stretch Linux
gcc-c++11-Qt5.12.2-nopython

00:07:54

failed #74842
stretch Linux
gcc-c++11-Qt5.9.0

00:08:20

 
  Test
skipped #74862
qt5113 Apple
Test:Mac-Cpp11
skipped #74860
Qt5101 VS2015
Test:VS2015-Qt-5.10.1-x64
skipped #74861
Qt5101 VS2017
Test:VS2017-Qt-5.10.1
skipped #74859
MultiThreads stretch Linux
debug-test-clang-c++11-Qt5.9.0
skipped #74856
stretch Linux
debug-test-gcc-c++11-Qt5.11.2
skipped #74855
stretch Linux
debug-test-gcc-c++11-Qt5.9.0
skipped #74857
MultiThreads stretch Linux
test-clang-c++11-Qt5.11.2
skipped #74858
MultiThreads stretch Linux
test-clang-c++11-Qt5.9.0
skipped #74853
stretch Linux
test-gcc-c++11-Qt5.11.2
skipped #74852
stretch Linux
test-gcc-c++11-Qt5.12.2
skipped #74854
stretch Linux
test-gcc-c++11-Qt5.9.0
 
Name Stage Failure
failed
debug-clang-c++11-Qt5.9.0 Build
  PythonSyntaxHighlighter *pythonHighlighter = new PythonSyntaxHighlighter(scriptWidget->document());
^
[ 83%] Building CXX object OpenFlipper/CoreApp/CMakeFiles/OpenFlipper.dir/OpenFlipper_autogen/mocs_compilation.cpp.o
1 warning generated.
[ 83%] Linking CXX executable ../../Build/bin/OpenFlipper
[ 83%] Built target OpenFlipper
Makefile:151: recipe for target 'all' failed
make: *** [all] Error 2
ERROR: Job failed: exit status 1
failed
VS2017-Qt-5.10.1 Build
201>-- fixup_bundle: done
201>Building Custom Rule E:/gitlab/builds/1900f1de/0/OpenFlipper-Free/OpenFlipper-Free/CMakeLists.txt
201>CMake does not need to re-run because E:/gitlab/builds/1900f1de/0/OpenFlipper-Free/OpenFlipper-Free/rel/CMakeFiles/generate.stamp is up-to-date.
201>Done building project "fixbundle.vcxproj".
202>------ Build started: Project: ALL_BUILD, Configuration: Release x64 ------
202>Building Custom Rule E:/gitlab/builds/1900f1de/0/OpenFlipper-Free/OpenFlipper-Free/CMakeLists.txt
202>CMake does not need to re-run because E:/gitlab/builds/1900f1de/0/OpenFlipper-Free/OpenFlipper-Free/rel/CMakeFiles/generate.stamp is up-to-date.
========== Build: 201 succeeded, 1 failed, 0 up-to-date, 0 skipped ==========
ERROR: Job failed: exit status 1
failed
clang-c++11-Qt5.11.2 Build
  PythonSyntaxHighlighter *pythonHighlighter = new PythonSyntaxHighlighter(scriptWidget->document());
^
[ 83%] Building CXX object OpenFlipper/CoreApp/CMakeFiles/OpenFlipper.dir/OpenFlipper_autogen/mocs_compilation.cpp.o
1 warning generated.
[ 83%] Linking CXX executable ../../Build/bin/OpenFlipper
[ 83%] Built target OpenFlipper
Makefile:151: recipe for target 'all' failed
make: *** [all] Error 2
ERROR: Job failed: exit status 1
failed
clang-c++11-Qt5.9.0 Build
/local/gitlab-runner/builds-1/2a1b4291/0/OpenFlipper-Free/OpenFlipper-Free/OpenFlipper/widgets/pythonWidget/pythonWidget.cc:64:28: warning: unused variable 'pythonHighlighter' [-Wunused-variable]
PythonSyntaxHighlighter *pythonHighlighter = new PythonSyntaxHighlighter(scriptWidget->document());
^
1 warning generated.
[ 83%] Linking CXX executable ../../Build/bin/OpenFlipper
[ 83%] Built target OpenFlipper
Makefile:151: recipe for target 'all' failed
make: *** [all] Error 2
ERROR: Job failed: exit status 1
failed
VS2015-Qt-5.10.1-x64 Build
201>  --
201> -- fixup_bundle: done
201> Building Custom Rule E:/gitlab/builds/281b716d/0/OpenFlipper-Free/OpenFlipper-Free/CMakeLists.txt
201> CMake does not need to re-run because E:/gitlab/builds/281b716d/0/OpenFlipper-Free/OpenFlipper-Free/rel/CMakeFiles/generate.stamp is up-to-date.
202>------ Build started: Project: ALL_BUILD, Configuration: Release x64 ------
202> Building Custom Rule E:/gitlab/builds/281b716d/0/OpenFlipper-Free/OpenFlipper-Free/CMakeLists.txt
202> CMake does not need to re-run because E:/gitlab/builds/281b716d/0/OpenFlipper-Free/OpenFlipper-Free/rel/CMakeFiles/generate.stamp is up-to-date.
========== Build: 201 succeeded, 1 failed, 0 up-to-date, 0 skipped ==========
ERROR: Job failed: exit status 1
failed
debug-gcc-c++11-Qt5.11.2 Build
[ 95%] Linking CXX shared module ../../Build/lib/plugins/libPlugin-FileBundle.so
[ 95%] Linking CXX shared module ../../Build/lib/plugins/libPlugin-FileHeightFieldImage.so
[ 95%] Built target Plugin-FileHeightFieldImage
[ 95%] Built target Plugin-FileBundle
[ 95%] Linking CXX shared module ../Build/lib/plugins/libPlugin-PropertyVis.so
[ 95%] Built target Plugin-PropertyVis
Makefile:151: recipe for target 'all' failed
make: *** [all] Error 2
ERROR: Job failed: exit status 1
failed
gcc-c++11-Qt5.9.0 Build
[ 95%] Linking CXX shared module ../../Build/lib/plugins/libPlugin-FileOBJ.so
[ 95%] Linking CXX shared module ../Build/lib/plugins/libPlugin-TextureControl.so
[ 95%] Built target Plugin-FileOBJ
[ 95%] Built target Plugin-TextureControl
[ 95%] Linking CXX shared module ../Build/lib/plugins/libPlugin-PropertyVis.so
[ 95%] Built target Plugin-PropertyVis
Makefile:151: recipe for target 'all' failed
make: *** [all] Error 2
ERROR: Job failed: exit status 1
failed
debug-gcc-c++11-Qt5.9.0 Build
[ 94%] Linking CXX shared module ../Build/lib/plugins/libPlugin-ViewControl.so
[ 94%] Linking CXX shared module ../Build/lib/plugins/libPlugin-Smoother.so
[ 94%] Built target Plugin-ViewControl
[ 94%] Built target Plugin-Smoother
[ 94%] Linking CXX shared module ../Build/lib/plugins/libPlugin-PropertyVis.so
[ 94%] Built target Plugin-PropertyVis
Makefile:151: recipe for target 'all' failed
make: *** [all] Error 2
ERROR: Job failed: exit status 1
failed
gcc-c++11-Qt5.11.2-nopython Build
[ 88%] Linking CXX shared module ../../Build/lib/plugins/libPlugin-SelectionBSplineCurve.so
[ 88%] Built target Plugin-SelectionBSplineCurve
[ 88%] Linking CXX shared module ../../Build/lib/plugins/libPlugin-Render-Classic.so
[ 88%] Built target Plugin-Render-Classic
[ 88%] Linking CXX shared module ../../Build/lib/plugins/libPlugin-SelectionMeshObject.so
[ 88%] Built target Plugin-SelectionMeshObject
Makefile:151: recipe for target 'all' failed
make: *** [all] Error 2
ERROR: Job failed: exit status 1
failed
gcc-c++11-Qt5.12.2-nopython Build
[ 98%] Linking CXX shared module ../Build/lib/plugins/libPlugin-MeshCompare.so
[ 98%] Built target Plugin-MeshCompare
[ 98%] Linking CXX shared module ../Build/lib/plugins/libPlugin-SkeletalAnimation.so
[ 98%] Built target Plugin-SkeletalAnimation
[ 98%] Linking CXX shared module ../Build/lib/plugins/libPlugin-TextureControl.so
[ 98%] Built target Plugin-TextureControl
Makefile:151: recipe for target 'all' failed
make: *** [all] Error 2
ERROR: Job failed: exit status 1
failed
gcc-c++11-Qt5.11.2 Build
[ 95%] Built target Plugin-ViewControl
[ 95%] Linking CXX shared module ../../Build/lib/plugins/libPlugin-FileOBJ.so
[ 95%] Built target Plugin-FileOBJ
ICECC[48072] 07:08:15: got exception 17 (137.226.115.10)
[ 95%] Linking CXX shared module ../Build/lib/plugins/libPlugin-PropertyVis.so
[ 95%] Built target Plugin-PropertyVis
Makefile:151: recipe for target 'all' failed
make: *** [all] Error 2
ERROR: Job failed: exit status 1
failed
gcc-c++11-Qt5.12.2 Build
[ 93%] Built target Plugin-FileLgt
[ 93%] Built target Plugin-FileBundle
[ 93%] Linking CXX shared module ../Build/lib/plugins/libPlugin-ViewControl.so
[ 93%] Built target Plugin-ViewControl
[ 93%] Linking CXX shared module ../Build/lib/plugins/libPlugin-PropertyVis.so
[ 93%] Built target Plugin-PropertyVis
Makefile:151: recipe for target 'all' failed
make: *** [all] Error 2
ERROR: Job failed: exit status 1