Updated OVM

30 jobs for master in 81 minutes and 12 seconds (queued for 26 seconds)
Status Job ID Name Coverage
  Build
passed #76532
qt5113 Apple
Mac-Cpp11

00:28:17

passed #76530
Qt5101 VS2015
VS2015-Qt-5.10.1-x64

00:14:26

passed #76531
Qt5101 VS2017
VS2017-Qt-5.10.1

00:14:56

passed #76526
MultiThreads stretch Linux
clang-c++11-Qt5.11.2

00:13:56

passed #76527
MultiThreads stretch Linux
clang-c++11-Qt5.9.0

00:16:00

passed #76529
MultiThreads stretch Linux
cppcheck

00:01:28

passed #76528
MultiThreads stretch Linux
debug-clang-c++11-Qt5.9.0

00:14:33

passed #76525
stretch Linux
debug-gcc-c++11-Qt5.11.2

00:06:58

passed #76524
stretch Linux
debug-gcc-c++11-Qt5.9.0

00:12:46

passed #76521
stretch Linux
gcc-c++11-Qt5.11.2

00:06:19

passed #76522
stretch Linux
gcc-c++11-Qt5.11.2-nopython

00:06:15

passed #76519
stretch Linux
gcc-c++11-Qt5.12.2

00:04:41

passed #76520
stretch Linux
gcc-c++11-Qt5.12.2-nopython

00:04:41

passed #76523
stretch Linux
gcc-c++11-Qt5.9.0

00:08:25

 
  Test
failed #76543
qt5113 Apple
Test:Mac-Cpp11

00:03:42

passed #76541
Qt5101 VS2015
Test:VS2015-Qt-5.10.1-x64

00:04:24

passed #76542
Qt5101 VS2017
Test:VS2017-Qt-5.10.1

00:05:39

failed #76540
MultiThreads stretch Linux
debug-test-clang-c++11-Qt5.9.0

00:05:41

failed #76537
stretch Linux
debug-test-gcc-c++11-Qt5.11.2

00:06:25

failed #76536
stretch Linux
debug-test-gcc-c++11-Qt5.9.0

00:07:17

failed #76538
MultiThreads stretch Linux
test-clang-c++11-Qt5.11.2

00:04:51

failed #76539
MultiThreads stretch Linux
test-clang-c++11-Qt5.9.0

00:04:11

failed #76534
stretch Linux
test-gcc-c++11-Qt5.11.2

00:04:56

failed #76533
stretch Linux
test-gcc-c++11-Qt5.12.2

00:04:49

failed #76535
stretch Linux
test-gcc-c++11-Qt5.9.0

00:04:25

 
  Deploy
skipped #76546
qt5113 Apple
Deploy:Mac-Cpp11
skipped #76544
Qt5101 VS2015
Deploy:VS2015-Qt-5.10.1-x64
skipped #76545
Qt5101 VS2017
Deploy:VS2017-Qt-5.10.1
skipped #76547
stretch Linux
Doc-publish
skipped #76548
stretch Linux
Sources
 
Name Stage Failure
failed
debug-test-clang-c++11-Qt5.9.0 Test

96% tests passed, 1 tests failed out of 26

Total Test time (real) = 272.13 sec

The following tests FAILED:
14 - PLUGIN-FILEOFF-box_binary.off (Timeout)
Errors while running CTest
ERROR: Job failed: exit status 1
failed
Test:Mac-Cpp11 Test

96% tests passed, 1 tests failed out of 24

Total Test time (real) = 191.34 sec

The following tests FAILED:
12 - PLUGIN-FILEOFF-box_binary.off (Timeout)
Errors while running CTest
ERROR: Job failed: exit status 1
failed
test-clang-c++11-Qt5.9.0 Test

96% tests passed, 1 tests failed out of 26

Total Test time (real) = 220.28 sec

The following tests FAILED:
14 - PLUGIN-FILEOFF-box_binary.off (Timeout)
Errors while running CTest
ERROR: Job failed: exit status 1
failed
debug-test-gcc-c++11-Qt5.9.0 Test

96% tests passed, 1 tests failed out of 26

Total Test time (real) = 239.53 sec

The following tests FAILED:
14 - PLUGIN-FILEOFF-box_binary.off (Timeout)
Errors while running CTest
ERROR: Job failed: exit status 1
failed
debug-test-gcc-c++11-Qt5.11.2 Test

96% tests passed, 1 tests failed out of 26

Total Test time (real) = 271.43 sec

The following tests FAILED:
14 - PLUGIN-FILEOFF-box_binary.off (Timeout)
Errors while running CTest
ERROR: Job failed: exit status 1
failed
test-clang-c++11-Qt5.11.2 Test

96% tests passed, 1 tests failed out of 26

Total Test time (real) = 258.55 sec

The following tests FAILED:
14 - PLUGIN-FILEOFF-box_binary.off (Timeout)
Errors while running CTest
ERROR: Job failed: exit status 1
failed
test-gcc-c++11-Qt5.11.2 Test

96% tests passed, 1 tests failed out of 26

Total Test time (real) = 210.12 sec

The following tests FAILED:
14 - PLUGIN-FILEOFF-box_binary.off (Timeout)
Errors while running CTest
ERROR: Job failed: exit status 1
failed
test-gcc-c++11-Qt5.12.2 Test

96% tests passed, 1 tests failed out of 26

Total Test time (real) = 208.77 sec

The following tests FAILED:
14 - PLUGIN-FILEOFF-box_binary.off (Timeout)
Errors while running CTest
ERROR: Job failed: exit status 1
failed
test-gcc-c++11-Qt5.9.0 Test

96% tests passed, 1 tests failed out of 26

Total Test time (real) = 200.22 sec

The following tests FAILED:
14 - PLUGIN-FILEOFF-box_binary.off (Timeout)
Errors while running CTest
ERROR: Job failed: exit status 1