Optimize Tetmesh Cell-Vertex iterator

9 jobs for cgg in 5 minutes and 13 seconds (queued for 1 second)
Status Job ID Name Coverage
  Test
failed #83372
VS2015
VS2015-32-bit

00:00:17

failed #83371
VS2015
VS2015-64-bit

00:00:23

failed #83370
VS2017
VS2017-32-bit

00:00:19

failed #83369
VS2015
VS2017-64-bit

00:00:21

failed #83366
Linux
clang-c++11

00:00:07

passed #83368
Linux
cppcheck

00:05:12

passed #83373
Linux
doc

00:00:04

failed #83365
Linux
gcc-c++11

00:00:04

failed #83367
Apple
macos-c++11

00:00:05

 
Name Stage Failure
failed
VS2015-32-bit Test
4>e:\gitlab\builds\1900f1de\0\openvolumemesh\openvolumemesh\src\openvolumemesh\core\../System/Compiler.hh(6): fatal error C1017: invalid integer constant expression
4> unittests_properties.cc
4>e:\gitlab\builds\1900f1de\0\openvolumemesh\openvolumemesh\src\openvolumemesh\core\../System/Compiler.hh(6): fatal error C1017: invalid integer constant expression
4> Generating Code...
5>------ Build started: Project: ALL_BUILD, Configuration: Release Win32 ------
5> Building Custom Rule E:/gitlab/builds/1900f1de/0/OpenVolumeMesh/OpenVolumeMesh/CMakeLists.txt
5> CMake does not need to re-run because E:/gitlab/builds/1900f1de/0/OpenVolumeMesh/OpenVolumeMesh/build-release/CMakeFiles/generate.stamp is up-to-date.
========== Build: 2 succeeded, 3 failed, 0 up-to-date, 0 skipped ==========
ERROR: Job failed: exit status 1
failed
VS2015-64-bit Test
5>  unittests_properties.cc
5>e:\gitlab\builds\281b716d\0\openvolumemesh\openvolumemesh\src\openvolumemesh\core\../System/Compiler.hh(6): fatal error C1017: invalid integer constant expression
5> Generating Code...
3>e:\gitlab\builds\281b716d\0\openvolumemesh\openvolumemesh\src\openvolumemesh\core\../System/Compiler.hh(6): fatal error C1017: invalid integer constant expression
6>------ Build started: Project: ALL_BUILD, Configuration: Release x64 ------
6> Building Custom Rule E:/gitlab/builds/281b716d/0/OpenVolumeMesh/OpenVolumeMesh/CMakeLists.txt
6> CMake does not need to re-run because E:/gitlab/builds/281b716d/0/OpenVolumeMesh/OpenVolumeMesh/build-release/CMakeFiles/generate.stamp is up-to-date.
========== Build: 2 succeeded, 4 failed, 0 up-to-date, 0 skipped ==========
ERROR: Job failed: exit status 1
failed
VS2017-64-bit Test
4>unittests_properties.cc
4>e:\gitlab\builds\1900f1de\0\openvolumemesh\openvolumemesh\src\openvolumemesh\core\../System/Compiler.hh(6): fatal error C1017: invalid integer constant expression
4>Generating Code...
4>Done building project "unittests.vcxproj" -- FAILED.
5>------ Build started: Project: ALL_BUILD, Configuration: Release x64 ------
5>Building Custom Rule E:/gitlab/builds/1900f1de/0/OpenVolumeMesh/OpenVolumeMesh/CMakeLists.txt
5>CMake does not need to re-run because E:/gitlab/builds/1900f1de/0/OpenVolumeMesh/OpenVolumeMesh/build-release/CMakeFiles/generate.stamp is up-to-date.
========== Build: 2 succeeded, 3 failed, 0 up-to-date, 0 skipped ==========
ERROR: Job failed: exit status 1
failed
VS2017-32-bit Test
4>unittests_properties.cc
4>e:\gitlab\builds\9d73ae51\0\openvolumemesh\openvolumemesh\src\openvolumemesh\core\../System/Compiler.hh(6): fatal error C1017: invalid integer constant expression
4>Generating Code...
4>Done building project "unittests.vcxproj" -- FAILED.
5>------ Build started: Project: ALL_BUILD, Configuration: Release Win32 ------
5>Building Custom Rule E:/gitlab/builds/9d73ae51/0/OpenVolumeMesh/OpenVolumeMesh/CMakeLists.txt
5>CMake does not need to re-run because E:/gitlab/builds/9d73ae51/0/OpenVolumeMesh/OpenVolumeMesh/build-release/CMakeFiles/generate.stamp is up-to-date.
========== Build: 2 succeeded, 3 failed, 0 up-to-date, 0 skipped ==========
ERROR: Job failed: exit status 1
failed
clang-c++11 Test
In file included from /local/gitlab-runner/builds/c565b521/0/OpenVolumeMesh/OpenVolumeMesh/src/OpenVolumeMesh/Attribs/../Core/ResourceManager.hh:44:
/local/gitlab-runner/builds/c565b521/0/OpenVolumeMesh/OpenVolumeMesh/src/OpenVolumeMesh/Attribs/../Core/../System/Compiler.hh:6:32: error: invalid token at start of a preprocessor expression
#if OPENVOLUMEMESH_CXX_VERSION >= 17
^
1 error generated.
make[2]: *** [src/CMakeFiles/OpenVolumeMesh.dir/build.make:63: src/CMakeFiles/OpenVolumeMesh.dir/OpenVolumeMesh/Attribs/InterfaceAttrib.cc.o] Error 1
make[1]: *** [CMakeFiles/Makefile2:96: src/CMakeFiles/OpenVolumeMesh.dir/all] Error 2
make: *** [Makefile:141: all] Error 2
ERROR: Job failed: exit status 1
failed
macos-c++11 Test
In file included from /Users/jenkins/builds/8dfb9a4a/0/OpenVolumeMesh/OpenVolumeMesh/src/OpenVolumeMesh/Attribs/../Core/ResourceManager.hh:44:
/Users/jenkins/builds/8dfb9a4a/0/OpenVolumeMesh/OpenVolumeMesh/src/OpenVolumeMesh/Attribs/../Core/../System/Compiler.hh:6:32: error: invalid token at start of a preprocessor expression
#if OPENVOLUMEMESH_CXX_VERSION >= 17
^
1 error generated.
make[2]: *** [src/CMakeFiles/OpenVolumeMesh.dir/OpenVolumeMesh/Attribs/InterfaceAttrib.cc.o] Error 1
make[1]: *** [src/CMakeFiles/OpenVolumeMesh.dir/all] Error 2
make: *** [all] Error 2
ERROR: Job failed: exit status 1
failed
gcc-c++11 Test
                 from /local/gitlab-runner/builds/96c8e8bf/0/OpenVolumeMesh/OpenVolumeMesh/src/OpenVolumeMesh/Attribs/InterfaceAttrib.hh:38,
from /local/gitlab-runner/builds/96c8e8bf/0/OpenVolumeMesh/OpenVolumeMesh/src/OpenVolumeMesh/Attribs/InterfaceAttrib.cc:1:
/local/gitlab-runner/builds/96c8e8bf/0/OpenVolumeMesh/OpenVolumeMesh/src/OpenVolumeMesh/Attribs/../Core/../System/Compiler.hh:6:32: error: operator '>=' has no left operand
#if OPENVOLUMEMESH_CXX_VERSION >= 17
^~
make[2]: *** [src/CMakeFiles/OpenVolumeMesh.dir/build.make:63: src/CMakeFiles/OpenVolumeMesh.dir/OpenVolumeMesh/Attribs/InterfaceAttrib.cc.o] Error 1
make[1]: *** [CMakeFiles/Makefile2:96: src/CMakeFiles/OpenVolumeMesh.dir/all] Error 2
make: *** [Makefile:141: all] Error 2
ERROR: Job failed: exit status 1