Implement InterfaceAttrib.

9 jobs for attrib-interface in 6 minutes and 23 seconds
latest
Status Job ID Name Coverage
  Test
failed #82185
VS2015
VS2015-32-bit

00:00:36

failed #82184
VS2015
VS2015-64-bit

00:00:41

failed #82183
VS2017
VS2017-32-bit

00:00:46

failed #82182
VS2015
VS2017-64-bit

00:00:41

failed #82179
Linux
clang-c++11

00:00:05

passed #82181
Linux
cppcheck

00:06:22

passed #82186
Linux
doc

00:00:23

failed #82178
Linux
gcc-c++11

00:00:05

failed #82180
Apple
macos-c++11

00:00:04

 
Name Stage Failure
failed
VS2015-32-bit Test
3>  unittests_properties.cc
3> unittests_smartptr.cc
3> Generating Code...
3>LINK : fatal error LNK1181: cannot open input file '..\Release\OpenVolumeMesh.lib'
4>------ Build started: Project: ALL_BUILD, Configuration: Release Win32 ------
4> Building Custom Rule E:/gitlab/builds/1900f1de/0/OpenVolumeMesh/OpenVolumeMesh/CMakeLists.txt
4> CMake does not need to re-run because E:/gitlab/builds/1900f1de/0/OpenVolumeMesh/OpenVolumeMesh/build-release/CMakeFiles/generate.stamp is up-to-date.
========== Build: 2 succeeded, 2 failed, 0 up-to-date, 0 skipped ==========
ERROR: Job failed: exit status 1
failed
VS2017-32-bit Test
3>unittests_smartptr.cc
3>Generating Code...
3>LINK : fatal error LNK1181: cannot open input file '..\Release\OpenVolumeMesh.lib'
3>Done building project "unittests.vcxproj" -- FAILED.
4>------ Build started: Project: ALL_BUILD, Configuration: Release Win32 ------
4>Building Custom Rule E:/gitlab/builds/9d73ae51/0/OpenVolumeMesh/OpenVolumeMesh/CMakeLists.txt
4>CMake does not need to re-run because E:/gitlab/builds/9d73ae51/0/OpenVolumeMesh/OpenVolumeMesh/build-release/CMakeFiles/generate.stamp is up-to-date.
========== Build: 2 succeeded, 2 failed, 0 up-to-date, 0 skipped ==========
ERROR: Job failed: exit status 1
failed
VS2017-64-bit Test
3>unittests_smartptr.cc
3>Generating Code...
3>LINK : fatal error LNK1181: cannot open input file '..\Release\OpenVolumeMesh.lib'
3>Done building project "unittests.vcxproj" -- FAILED.
4>------ Build started: Project: ALL_BUILD, Configuration: Release x64 ------
4>Building Custom Rule E:/gitlab/builds/281b716d/0/OpenVolumeMesh/OpenVolumeMesh/CMakeLists.txt
4>CMake does not need to re-run because E:/gitlab/builds/281b716d/0/OpenVolumeMesh/OpenVolumeMesh/build-release/CMakeFiles/generate.stamp is up-to-date.
========== Build: 2 succeeded, 2 failed, 0 up-to-date, 0 skipped ==========
ERROR: Job failed: exit status 1
failed
VS2015-64-bit Test
3>  unittests_properties.cc
3> unittests_smartptr.cc
3> Generating Code...
3>LINK : fatal error LNK1181: cannot open input file '..\Release\OpenVolumeMesh.lib'
4>------ Build started: Project: ALL_BUILD, Configuration: Release x64 ------
4> Building Custom Rule E:/gitlab/builds/1900f1de/0/OpenVolumeMesh/OpenVolumeMesh/CMakeLists.txt
4> CMake does not need to re-run because E:/gitlab/builds/1900f1de/0/OpenVolumeMesh/OpenVolumeMesh/build-release/CMakeFiles/generate.stamp is up-to-date.
========== Build: 2 succeeded, 2 failed, 0 up-to-date, 0 skipped ==========
ERROR: Job failed: exit status 1
failed
gcc-c++11 Test
In file included from /local/gitlab-runner/builds-1/fec29b69/0/OpenVolumeMesh/OpenVolumeMesh/src/OpenVolumeMesh/Attribs/InterfaceAttrib.cc:1:
/local/gitlab-runner/builds-1/fec29b69/0/OpenVolumeMesh/OpenVolumeMesh/src/OpenVolumeMesh/Attribs/InterfaceAttrib.hh:39:10: fatal error: ../Config/Export.hh: No such file or directory
#include "../Config/Export.hh"
^~~~~~~~~~~~~~~~~~~~~
compilation terminated.
make[2]: *** [src/CMakeFiles/OpenVolumeMeshStatic.dir/build.make:63: src/CMakeFiles/OpenVolumeMeshStatic.dir/OpenVolumeMesh/Attribs/InterfaceAttrib.cc.o] Error 1
make[1]: *** [CMakeFiles/Makefile2:98: src/CMakeFiles/OpenVolumeMeshStatic.dir/all] Error 2
make: *** [Makefile:130: all] Error 2
ERROR: Job failed: exit status 1
failed
macos-c++11 Test
In file included from /Users/jenkins/builds/b72f60fc/0/OpenVolumeMesh/OpenVolumeMesh/src/OpenVolumeMesh/Attribs/InterfaceAttrib.cc:1:
/Users/jenkins/builds/b72f60fc/0/OpenVolumeMesh/OpenVolumeMesh/src/OpenVolumeMesh/Attribs/InterfaceAttrib.hh:39:10: fatal error: '../Config/Export.hh' file not found
#include "../Config/Export.hh"
^~~~~~~~~~~~~~~~~~~~~
1 error generated.
make[2]: *** [src/CMakeFiles/OpenVolumeMeshStatic.dir/OpenVolumeMesh/Attribs/InterfaceAttrib.cc.o] Error 1
make[1]: *** [src/CMakeFiles/OpenVolumeMeshStatic.dir/all] Error 2
make: *** [all] Error 2
ERROR: Job failed: exit status 1
failed
clang-c++11 Test
In file included from /local/gitlab-runner/builds/96c8e8bf/0/OpenVolumeMesh/OpenVolumeMesh/src/OpenVolumeMesh/Attribs/InterfaceAttrib.cc:1:
/local/gitlab-runner/builds/96c8e8bf/0/OpenVolumeMesh/OpenVolumeMesh/src/OpenVolumeMesh/Attribs/InterfaceAttrib.hh:39:10: fatal error: '../Config/Export.hh' file not found
#include "../Config/Export.hh"
^~~~~~~~~~~~~~~~~~~~~
1 error generated.
make[2]: *** [src/CMakeFiles/OpenVolumeMeshStatic.dir/build.make:63: src/CMakeFiles/OpenVolumeMeshStatic.dir/OpenVolumeMesh/Attribs/InterfaceAttrib.cc.o] Error 1
make[1]: *** [CMakeFiles/Makefile2:98: src/CMakeFiles/OpenVolumeMeshStatic.dir/all] Error 2
make: *** [Makefile:130: all] Error 2
ERROR: Job failed: exit status 1